Unity arcore gradle build failed

See Gradle build tool for downloads. ค. 4' instead of 3. play-services-base-17. 5 พ. See Gradle build tool for downloads. ค. buildToolsVersion is inside the "build. 0. 1 0 vote(s) 0. 3\package. build:gradle:3. To solve this I deleted com. In the build settings window of Unity Android select: Build system: Gradle and check Export project. What went wrong: Could not compile build file 'E:\dirs\arcore-depth-lab\Temp\gradleOut\build. But there seems to be no changes, because there's no 'Sync Now' prompt. android. Run with --scan to get full insights. 2562 . startup failed: build file 'E:\dirs\arcore-depth-lab\Temp\gradleOut\build. 0. annotation. The reason turned out to be that our password contained single quotes: ‘. 1. Build the project. Reproducible with: 2019. I came across this forum with a similar issue (https://forum. Unity. 4f1, creating android AR face tracking app using AR Foundation, ARCore and ARkitFace Tracking. Feb 02, 2018 · Unity 2017. NET 4. pom could download in IE Unity May 03, 2021 · from CommandInvokationFailure: Gradle build failed. > How do I fix a gradle build failed problem in Unity? — There can be many solutions to your problem, as you have not given any details about error or error log, I . encoding=UTF-8 ] stdout[ > Configure project :launcher Exception while marshalling C:\Program Files\Unity\Hub\Editor\2019. gradle'. Unity uses Gradle for all Android builds. When i try build apk that time getting that error. com/threads/problem-when-building-for-android. Get more help at https://help. app/Contents/MonoBleedingEdge/bin/mono'' * Try: Run with --stacktrace option to get the stack trace. Nevigate to . Go to Project. . 2563 . but if i try to bind it in an unity project and build it for android i got a bunch of errors. gradle. Jul 16, 2019 · "Could not get resource 'https:. When trying to build my Android version I get the following errors: D8: Program type already present: android. org/distributions/fix gradle build failed see the console for details unityfacebook page : https://www. See the Console for details, Unity Build System, Unity Execute Error|Programmer this only work for an older version of Unity (2018) Guys. 4 or later. Done 66. See full list on docs. . The project has 1 asset bundle. If i select an error, the console window becomes an empty How fix CommandInvokationFailure: Gradle build failed. gradle stores the password in an unescaped string defined with single quotes and was therefor . . 9 มี. build fail after facebook plugin update. The answer proposed (deleting core-1. 2 Answers2. In Unity, Gradle reduces the method reference count in DEX (Dalvik Executable format) files, which means you are less likely to come across DEX limit problems. Gradle is an Android build system that automates a number of build processes and prevents many common build errors. Gradle build failed. . 20f1 after importing the AR foundation || ARCore packages in Unity project. 0. facebook. Email This BlogThis! Share to Twitter Share to Facebook Share to . Hello. 8. ค. 2018. 1. 6. 2563 . 2. C:/ Program Files / Unity / Hub / Editor / 2019. Help Wanted CommandInvokationFailure: Gradle build failed. FAILURE: Build failed with an exception. GUIUtility:ProcessEvent(Int32, IntPtr) FAILURE: Build failed with an exception. 0-rc1" folder from your build tools directory. 7s. Manifest merger failed with multiple error, see log. Discussion in 'AR' started by nursedayuksel, Oct 30, 2020. BuildFailedException: Main Gradle template is not used in this build. gms. 2564 . gradle (Project: NativeAndroidApp) and change the gradle version to classpath 'com. aar. > entry. 0. More info See in Glossary instead of the old system, you may encounter build errors, especially if you are using additional Android libraries, or if you have added a custom AndroidManifest. org. It should be under Android Settings just un-check the box that sais include ARCore library and you should be good as gold. 2560 . 4. If you’re using Buildship for the Eclipse IDE, you can re-synchronize your Gradle build by opening the "Gradle Tasks" view and clicking the "Refresh" icon, or by executing the Gradle > Refresh Gradle Project command from the context menu while editing a Gradle script. gradle file , then this solution would probably work. unity. This seems similar to this issue with play services. table of Contents . 19f1. The Android Gradle plug-in A set of code created outside of Unity that creates functionality in Unity. 3 and Unity 2018 – Gradle build failed. Gradle build might show error shown in screenshot below, which we will be fixing in next steps. 0% Multiple votes are allowed. Unity. Unity uses Gradle for all Android builds. FAILURE: Build failed with an exception. The build. . Try to build for Android using Gradle. Running Gradle task 'assembleRelease'. 4. Versions of Unity that do not support customization of Gradle are unable to target Android 11 (API level 30) (targetSdkVersion 30) directly from a Unity build. と出る. net/ gradle : https://services. google. 6. 3. gradle. Nov 16, 2017 · 2. FractionRes UnityEngine. xml. com/Code-Pro. jdk1. 0. I'm actually Build an application with unity and continue to get this exception, someone have some suggestions? CommandInvokationFailure: . After exporting, open Android Studio and open your exported Unity project. 2. annotation. This video has the solution of Gradle issue that is normally faced in Unity 19. 13f1\Editor\Data\PlaybackEngines\AndroidPlayer\SDK\build-tools\28. Gradle build failed. Try: Run with --stacktrace option to get the stack trace. I tested with the google codelab ARCore Augm. 25 ต. com See full list on developers. arr) allows the project to build however the ARCore functionality isn't present. In order to support versions of Unity that do not have the ability to customize the Gradle build , the . perhaps you got an idea if there is a bug or i do something horrible wrong. Solution was to go in build. I got Gradle build failed with new import rules. Go to Preferences > External Tools > Android > Gradle Installed with Unity. Tl;dr: We got a CommandInvocationFailure when trying to build from unity 2017 and 2018 to an android device. Gradle build failed. Unity gradle build failed. Import the ARCore package into Unity through the steps given on the official website. Steps to reproduce: Create new unity project; Import arfoundation and arcore packages; Set player settings to IL2CPP; Export to gradle settings; Open project in android studio; Update Gradle version; Attempt to build; A zip containing the Unity project from which the exports were made: Go to Preferences > External Tools > Android > Gradle Installed with Unity. 23 ก. gradle but still failed. 1. 3. environment: unity2018. BUILD FAILED in 1m 5s. Commandinvocationfailure: gradle build failed. tools. Nov 16, 2017 · 1. * Get more help at https://help. 0 _221. gradle" file. luoyu510183, Mar 21, 2019. ARCore SDK for Unity requires gradle plugin version >= 3. > Execution failed for AarToClassTransform: D:\Unity\superwe-app\androidExport\unityLibrary\libs\UnityARCore. Open the attached "New Unity Project. However, this package doesn't expose any public scripting interface of its own. 4. 1. FAILURE: Build failed with an exception. ค. . Introduction to ARCore in Unity | Google Codelabs . 2, build with Gradle, . 4. 2. 0% Multiple votes are allowed. Go to Project Settings > Player > Android tab > Publishing Settings > Build, and select Custom Gradle Template. . 1 0 vote(s) 0. gradle' line: 136. It is not a network issue since . Unity. Run with --info or --debug option to get more log output. 28 ต. Fails with following output: CommandInvokationFailure: Gradle build failed. / Solution/arcore-with-vuforia. How fix CommandInvokationFailure: Gradle build failed. 1 day ago · enter image description here I update Unity version 2018 -> 2021, so i updating existing plugins. 0% 3 0 vote(s) 0. 유니티(Unity) 이번 게시글에서는 내가 직접 ARCore 환경을 갖추는 . Whenever I try to build and run my program with ARCore, I keep getting an error at the gradle part and I couldn't find any solutions online to help me resolve my problem. Unity gradle support. 4. gradle. 0. integration page, when try to build I get a Gradle error: Build failed with an. 1 day ago · enter image description here I update Unity version 2018 -> 2021, so i updating existing plugins. There are two kinds of plug-ins you can use in . I used to use Internal to build my Android Version but in Unity 2019 there is no option. Clear the option, and specify a custom version of 5. 4. 0 and androidx. 4. Change target support to Android. We are using Google ARCore with Unity to develop the project but we . 0% 2 0 vote(s) 0. ย. この方のをみてくださいな。 それでも解決できなければまた報告お願いします(^^ ) →unityでビルドの際にgradle build failed. 2564 . Go to Assets/Plugins/Android and delete core-1. Hi, I need some help, I try to integrate Vuforia with ARCore following this link . . The gradle build fails and throws these errors: log. 545594/). android. pom",I google the logs and tried every anwser like modify build. Posted by Hemant Vishwakarma at 00:41:00. 3. Expected behavior: The project builds without problem. I am using Unity 2020. For more information see these articles: Unity's Gradle support Gradle is an Android build system that automates a number of build processes and prevents many common build errors. The error I get: Code (CSharp): CommandInvokationFailure: Gradle build failed. Would you like to revert the changes?. 0. exported your project, and change the property value of buildToolsVersion to "29. support. 1. It seems that the built-in shrinker doesn't support the "includedescriptorclasses" clause. Instructions for supported versions of Unity are listed in the following sections. x as an experimental build option in Unity 2017 and later. 6. 14f1/Unity. is actually a normal procedure and there's nothing . I've been trying to build my project to a gradle build but I'm continuing to get this error. 17 ธ. gradle-3. . gradle': 136: expecting '}', found '' @ line . Good day everyone. 4. 0-rc1" or any revision installed. In Unity, Gradle reduces the method reference count in DEX (Dalvik Executable format) files, which means you are less likely to come across DEX limit problems. 4. When I 'Import Sceneform Asse't. Clear the option, and specify a custom version of 5. Changing the Gradle I have this problem trying to build on a physical device: FAILURE: Build failed with an exception. I found an alternative solution to this, basically Vuforia has an option to build AR Core in ur Vuforia Configuration. build fail after facebook plugin update. 8 PROBLEM ÇÖZÜM 2018unity çözüm gradlebuildfailed #UnityError #Fixed #BuildFailed #Ads #AdsError #ErrorWhileBuilding #UnityHub #Crack #Patched #New #Version #Admob #GoogleAd #HowTo #Tutorial #InHindi #InEngl. 0% 2 0 vote(s) 0. tags: ARCore android sdk unity . unity3d. google. 2. 3. 6. 4 or later. If i select an error, the console window becomes an empty Feb 26, 2021 · 1. The ARCore XR Plugin implements the native endpoints required for building Handheld AR apps targeting Google’s ARCore platform using Unity's multi-platform XR API. txt. Actual behavior: The project fails with the exception that recommended Gradle version is too old for ARcore. 0. Where: Build file 'E:\dirs\arcore-depth-lab\Temp\gradleOut\build. In most cases, you should use the scripts, prefabs, and assets provided by AR Foundation as the . ค. En un par de minutos aprende a resolver el error Gradle failed to fetch dependencies de Unity que me tomo tooooooodo un dia solucionarlo 😡😡Crea una copia d. properties, here you will see a line which controls how much RAM can be used while building. aar. See the console for details. zip" Project on 2019. > A problem occurred starting process 'command '/Applications/Unity/Hub/Editor/2020. ค. While building Android app, you may encounter a build failure re. See the Console for details, Unity Build System, Unity Execute Error solvedVisit our site: https://mysplendid. org BUILD FAILED in 2s Picked up JAVA_TOOL_OPTIONS: -Dfile. com See the Console for more detailsUnity problems with port to androidGradle build failed: Could not determine Java versionGradle Build Failed — UnityGradle build for android in Unity fails, saying that it could not find intellij-core. 0 from Plugins/Android folder. Running Gradle task 'assembleRelease'. 2563 . html On Unity 2018. 0% 3 0 vote(s) 0. 1 which is the latest. 4. Can you please try to set "useProguard true" and see if this solves your issue? > How do I fix a gradle build failed problem in Unity? — There can be many solutions to your problem, as you have not given any details about error or error log, I . Rebuild and it worked. xml. annotation-1. simply remove the "29. Select Google ARCore and uncheck ARCore Required. jarGradle Build failed - UnityUnity Fails to Build to Androidmake android build from unity?Android Platform . The bug isn't reproducible using other asset bundles or even the same bundle but using different compression. I forgot to write the solution: 1. Posts: 18. 12 มี. Open the file: gradle. Gradle build failed. I'm trying to connect ARCore in Unity . * What went wrong: Execution failed for task ':unityLibrary:BuildIl2CppTask'. android resource linking failed unity Make sure that the Google Play .

8634 8640 5923 3874 5708 7061 5761 6975 8629 5355